{"text_format":"1","workbook":"xlsx","n_sheets":3,"sheets":["PPR-2017-01-Dublin","Chart","Regions"],"not_rendered":{"charts":1,"images":0,"macros":1,"external_links":0,"defined_names":1,"comments":0,"pivot_tables":0},"unopened":[],"bounds":{"document_bytes":16777216,"sheet_cells":100000,"rows_first":2000,"rows_last":500,"rows_between":2000,"halvings":0,"cell_chars":16384,"cell_head_chars":4096},"cells_cut":0,"cells_raw":0,"read":"whole","date_system":"1900"}

{"sheet":"PPR-2017-01-Dublin","index":0,"n_rows":1012,"n_cols":18,"rows_kept":1012,"cut":false,"hidden":false,"merged":[]}
["Date of Sale (dd/mm/yyyy)",null,"Month","Address","Region","County","Price (€)","Not Full Market Price","VAT Exclusive","Description of Property","Property Size Description","Postal Code"]
["2017-01-01",{"$f":"DATE(RIGHT(A2,4),MID(A2,4,2),LEFT(A2,2))","v":"2739-01-11"},{"$f":"IF(ISERROR(MONTH(A2)),MONTH(B2),MONTH(A2))","v":1},"1 PINTAIL HOUSE, REDCOURT OAKS, SEAFIELD RD EAST",{"$f":"VLOOKUP(L2,Regions!A:B,2,0)","v":"N"},"Dublin",242424,"Yes","No","Second-Hand Dwelling house /Apartment",null,"Dublin 3",null,null,null,null,null,42955]
["2017-01-01",{"$f":"DATE(RIGHT(A3,4),MID(A3,4,2),LEFT(A3,2))","v":"2739-01-11"},{"$f":"IF(ISERROR(MONTH(A3)),MONTH(B3),MONTH(A3))","v":1},"11 PINTAIL HOUSE, REDCOURT OAKS, SEAFIELD RD EAST",{"$f":"VLOOKUP(L3,Regions!A:B,2,0)","v":"N"},"Dublin",242424,"Yes","No","Second-Hand Dwelling house /Apartment",null,"Dublin 3"]
["2017-01-01","2739-01-11",1,"124 SEAFIELD RD, CLONTARF, DUBLIN 3",{"$f":"VLOOKUP(L4,Regions!A:B,2,0)","v":"N"},"Dublin",535500,"Yes","No","Second-Hand Dwelling house /Apartment",null,"Dublin 3"]
["2017-01-01","2739-01-11",1,"126 SEAFIELD RD, CLONTARF, DUBLIN 3",{"$f":"VLOOKUP(L5,Regions!A:B,2,0)","v":"N"},"Dublin",630000,"No","No","Second-Hand Dwelling house /Apartment",null,"Dublin 3"]
["2017-01-01","2739-01-11",1,"128 SEAFIELD RD, CLONTARF, DUBLIN 3",{"$f":"VLOOKUP(L6,Regions!A:B,2,0)","v":"N"},"Dublin",535500,"Yes","No","Second-Hand Dwelling house /Apartment",null,"Dublin 3"]
["2017-01-01","2739-01-11",1,"13 PINTAIL HOUSE, REDCOURT OAKS, SEAFIELD RD EAST DUBLIN 3",{"$f":"VLOOKUP(L7,Regions!A:B,2,0)","v":"N"},"Dublin",271800,"Yes","No","Second-Hand Dwelling house /Apartment",null,"Dublin 3"]
["2017-01-01","2739-01-11",1,"18 PINTAIL HOUSE, REDCOURT OAKS, SEAFIELD RD EAST",{"$f":"VLOOKUP(L8,Regions!A:B,2,0)","v":"N"},"Dublin",242424,"Yes","No","Second-Hand Dwelling house /Apartment",null,"Dublin 3"]
["2017-01-01","2739-01-11",1,"20 PINTAIL HOUSE, REDCOURT OAKS, SEAFIELD RD EAST DUBLIN 3",{"$f":"VLOOKUP(L9,Regions!A:B,2,0)","v":"N"},"Dublin",360000,"No","No","Second-Hand Dwelling house /Apartment",null,"Dublin 3"]
["2017-01-01","2739-01-11",1,"25 PINTAIL HOUSE, REDCOURT OAKS, SEAFIELD RD EAST",{"$f":"VLOOKUP(L10,Regions!A:B,2,0)","v":"N"},"Dublin",148148,"Yes","No","Second-Hand Dwelling house /Apartment",null,"Dublin 3"]
["2017-01-01","2739-01-11",1,"32 PINTAIL HOUSE, REDCOURT OAKS, SEAFIELD RD EAST DUBLIN 3",{"$f":"VLOOKUP(L11,Regions!A:B,2,0)","v":"N"},"Dublin",352800,"Yes","No","Second-Hand Dwelling house /Apartment",null,"Dublin 3"]
["2017-01-01","2739-01-11",1,"35 PINTAIL HOUSE, REDCOURT OAKS, SEAFIELD RD EAST DUBLIN 3",{"$f":"VLOOKUP(L12,Regions!A:B,2,0)","v":"N"},"Dublin",215600,"Yes","No","Second-Hand Dwelling house /Apartment",null,"Dublin 3"]
["2017-01-01","2739-01-11",1,"5 SEAFIELD GROVE, CLONTARF, DUBLIN 3",{"$f":"VLOOKUP(L13,Regions!A:B,2,0)","v":"N"},"Dublin",830000,"No","No","Second-Hand Dwelling house /Apartment",null,"Dublin 3"]
["2017-01-01","2739-01-11",1,"8 PINTAIL HOUSE, REDCOURT OAKS, SEAFIELD RD EAST DUBLIN 3",{"$f":"VLOOKUP(L14,Regions!A:B,2,0)","v":"N"},"Dublin",271800,"Yes","No","Second-Hand Dwelling house /Apartment",null,"Dublin 3"]
["2017-01-01","2739-01-11",1,"9 TEAL HOUSE, REDCOURT OAKS SEAFIELD RD EAST, CLONTARF",{"$f":"VLOOKUP(L15,Regions!A:B,2,0)","v":"N"},"Dublin",66000,"Yes","No","Second-Hand Dwelling house /Apartment",null,"Dublin 3"]
["2017-02-01","2772-08-11",2,"31 UPPER DRUMCONDRA ROAD, DRUMCONDRA, DUBLIN 9",{"$f":"VLOOKUP(L16,Regions!A:B,2,0)","v":{"$error":"#N/A"}},"Dublin",260000,"No","No","Second-Hand Dwelling house /Apartment"]
["2017-03-01","2802-12-12",3,"114 SHELMARTIN AVE, MARINO, DUBLIN 3",{"$f":"VLOOKUP(L17,Regions!A:B,2,0)","v":"N"},"Dublin",375000,"No","No","Second-Hand Dwelling house /Apartment",null,"Dublin 3"]
["2017-03-01","2802-12-12",3,"13 THE VIEW, ROBSWALL, MALAHIDE",{"$f":"VLOOKUP(L18,Regions!A:B,2,0)","v":{"$error":"#N/A"}},"Dublin",575000,"No","No","Second-Hand Dwelling house /Apartment"]
["2017-03-01","2802-12-12",3,"180 THE LINKS, ELM PARK, MERRION RD DUBLIN 4",{"$f":"VLOOKUP(L19,Regions!A:B,2,0)","v":"W"},"Dublin",292000,"No","No","Second-Hand Dwelling house /Apartment",null,"Dublin 4"]
["2017-03-01","2802-12-12",3,"33 Belarmine Grove, Belarmine Woods, Stepaside",{"$f":"VLOOKUP(L20,Regions!A:B,2,0)","v":{"$error":"#N/A"}},"Dublin",348018,"No","Yes","New Dwelling house /Apartment","greater than or equal to 38 sq metres and less than 125 sq metres"]
["2017-03-01","2802-12-12",3,"4 Park lane, Belltree, Clongriffen",{"$f":"VLOOKUP(L21,Regions!A:B,2,0)","v":{"$error":"#N/A"}},"Dublin",255507,"No","Yes","New Dwelling house /Apartment","greater than or equal to 38 sq metres and less than 125 sq metres"]
["2017-03-01","2802-12-12",3,"74 ST MAGDALEN TERRACE, STELLA GARDENS, IRISHTOWN DUBLIN 4",{"$f":"VLOOKUP(L22,Regions!A:B,2,0)","v":"W"},"Dublin",452000,"No","No","Second-Hand Dwelling house /Apartment",null,"Dublin 4"]
["2017-03-01","2802-12-12",3,"83 UPPER TREES RD, MOUNT MERRION, DUBLIN",{"$f":"VLOOKUP(L23,Regions!A:B,2,0)","v":{"$error":"#N/A"}},"Dublin",260000,"No","No","Second-Hand Dwelling house /Apartment"]
["2017-04-01","2828-03-13",4,"117 BALALLY DR, DUNDRUM, DUBLIN 16",{"$f":"VLOOKUP(L24,Regions!A:B,2,0)","v":"E"},"Dublin",625000,"No","No","Second-Hand Dwelling house /Apartment",null,"Dublin 16"]
["2017-04-01","2828-03-13",4,"128B MERRION RD, BALLSBRIDGE, DUBLIN 4",{"$f":"VLOOKUP(L25,Regions!A:B,2,0)","v":{"$error":"#N/A"}},"Dublin",1150000,"No","No","Second-Hand Dwelling house /Apartment"]
["2017-04-01","2828-03-13",4,"129 THE LINKS, ELMPARK, MERRION RD DUBLIN 4",{"$f":"VLOOKUP(L26,Regions!A:B,2,0)","v":"W"},"Dublin",100000,"No","No","Second-Hand Dwelling house /Apartment",null,"Dublin 4"]
["2017-04-01","2828-03-13",4,"130 THE LINKS, ELMPARK, MERRION RD DUBLIN 4",{"$f":"VLOOKUP(L27,Regions!A:B,2,0)","v":"W"},"Dublin",100000,"No","No","Second-Hand Dwelling house /Apartment",null,"Dublin 4"]
["2017-04-01","2828-03-13",4,"16 YORK COURT, YORK RD, DUNLAOIGHAIRE",{"$f":"VLOOKUP(L28,Regions!A:B,2,0)","v":{"$error":"#N/A"}},"Dublin",222500,"No","No","Second-Hand Dwelling house /Apartment"]
["2017-04-01","2828-03-13",4,"18 GAZELLE LANE, TYRRELSTOWN, DUBLIN 15",{"$f":"VLOOKUP(L29,Regions!A:B,2,0)","v":"S"},"Dublin",210000,"No","No","Second-Hand Dwelling house /Apartment",null,"Dublin 15"]
["2017-04-01","2828-03-13",4,"184 LARAGHCON, LUCAN, DUBLIN",{"$f":"VLOOKUP(L30,Regions!A:B,2,0)","v":{"$error":"#N/A"}},"Dublin",735000,"No","No","Second-Hand Dwelling house /Apartment"]
{"$rows_left_out":983}
{"sheet":"Chart","index":1,"n_rows":7,"n_cols":25,"rows_kept":7,"cut":false,"hidden":false,"merged":[]}
[null,null,null,"Dublin 1","Dublin 10","Dublin 11","Dublin 12","Dublin 13","Dublin 14","Dublin 15","Dublin 16","Dublin 17","Dublin 18","Dublin 2","Dublin 20","Dublin 22","Dublin 24","Dublin 3","Dublin 4","Dublin 5","Dublin 6","Dublin 6w","Dublin 7","Dublin 8","Dublin 9"]
["min","max","describe","count"]
[0,16000,"0 to 16,000",{"$f":"COUNTIFS('PPR-2017-01-Dublin'!$G:$G,\">\"&$A3,'PPR-2017-01-Dublin'!$G:$G,\"<=\"&$B3,'PPR-2017-01-Dublin'!#REF!,D$1)","v":{"$error":"#REF!"}},{"$f":"COUNTIFS('PPR-2017-01-Dublin'!$G:$G,\">\"&$A3,'PPR-2017-01-Dublin'!$G:$G,\"<=\"&$B3,'PPR-2017-01-Dublin'!#REF!,E$1)","v":{"$error":"#REF!"}},{"$f":"COUNTIFS('PPR-2017-01-Dublin'!$G:$G,\">\"&$A3,'PPR-2017-01-Dublin'!$G:$G,\"<=\"&$B3,'PPR-2017-01-Dublin'!#REF!,F$1)","v":{"$error":"#REF!"}},{"$f":"COUNTIFS('PPR-2017-01-Dublin'!$G:$G,\">\"&$A3,'PPR-2017-01-Dublin'!$G:$G,\"<=\"&$B3,'PPR-2017-01-Dublin'!#REF!,G$1)","v":{"$error":"#REF!"}},{"$f":"COUNTIFS('PPR-2017-01-Dublin'!$G:$G,\">\"&$A3,'PPR-2017-01-Dublin'!$G:$G,\"<=\"&$B3,'PPR-2017-01-Dublin'!#REF!,H$1)","v":{"$error":"#REF!"}},{"$f":"COUNTIFS('PPR-2017-01-Dublin'!$G:$G,\">\"&$A3,'PPR-2017-01-Dublin'!$G:$G,\"<=\"&$B3,'PPR-2017-01-Dublin'!#REF!,I$1)","v":{"$error":"#REF!"}},{"$f":"COUNTIFS('PPR-2017-01-Dublin'!$G:$G,\">\"&$A3,'PPR-2017-01-Dublin'!$G:$G,\"<=\"&$B3,'PPR-2017-01-Dublin'!#REF!,J$1)","v":{"$error":"#REF!"}},{"$f":"COUNTIFS('PPR-2017-01-Dublin'!$G:$G,\">\"&$A3,'PPR-2017-01-Dublin'!$G:$G,\"<=\"&$B3,'PPR-2017-01-Dublin'!#REF!,K$1)","v":{"$error":"#REF!"}},{"$f":"COUNTIFS('PPR-2017-01-Dublin'!$G:$G,\">\"&$A3,'PPR-2017-01-Dublin'!$G:$G,\"<=\"&$B3,'PPR-2017-01-Dublin'!#REF!,L$1)","v":{"$error":"#REF!"}},{"$f":"COUNTIFS('PPR-2017-01-Dublin'!$G:$G,\">\"&$A3,'PPR-2017-01-Dublin'!$G:$G,\"<=\"&$B3,'PPR-2017-01-Dublin'!#REF!,M$1)","v":{"$error":"#REF!"}},{"$f":"COUNTIFS('PPR-2017-01-Dublin'!$G:$G,\">\"&$A3,'PPR-2017-01-Dublin'!$G:$G,\"<=\"&$B3,'PPR-2017-01-Dublin'!#REF!,N$1)","v":{"$error":"#REF!"}},{"$f":"COUNTIFS('PPR-2017-01-Dublin'!$G:$G,\">\"&$A3,'PPR-2017-01-Dublin'!$G:$G,\"<=\"&$B3,'PPR-2017-01-Dublin'!#REF!,O$1)","v":{"$error":"#REF!"}},{"$f":"COUNTIFS('PPR-2017-01-Dublin'!$G:$G,\">\"&$A3,'PPR-2017-01-Dublin'!$G:$G,\"<=\"&$B3,'PPR-2017-01-Dublin'!#REF!,P$1)","v":{"$error":"#REF!"}},{"$f":"COUNTIFS('PPR-2017-01-Dublin'!$G:$G,\">\"&$A3,'PPR-2017-01-Dublin'!$G:$G,\"<=\"&$B3,'PPR-2017-01-Dublin'!#REF!,Q$1)","v":{"$error":"#REF!"}},{"$f":"COUNTIFS('PPR-2017-01-Dublin'!$G:$G,\">\"&$A3,'PPR-2017-01-Dublin'!$G:$G,\"<=\"&$B3,'PPR-2017-01-Dublin'!#REF!,R$1)","v":{"$error":"#REF!"}},{"$f":"COUNTIFS('PPR-2017-01-Dublin'!$G:$G,\">\"&$A3,'PPR-2017-01-Dublin'!$G:$G,\"<=\"&$B3,'PPR-2017-01-Dublin'!#REF!,S$1)","v":{"$error":"#REF!"}},{"$f":"COUNTIFS('PPR-2017-01-Dublin'!$G:$G,\">\"&$A3,'PPR-2017-01-Dublin'!$G:$G,\"<=\"&$B3,'PPR-2017-01-Dublin'!#REF!,T$1)","v":{"$error":"#REF!"}},{"$f":"COUNTIFS('PPR-2017-01-Dublin'!$G:$G,\">\"&$A3,'PPR-2017-01-Dublin'!$G:$G,\"<=\"&$B3,'PPR-2017-01-Dublin'!#REF!,U$1)","v":{"$error":"#REF!"}},{"$f":"COUNTIFS('PPR-2017-01-Dublin'!$G:$G,\">\"&$A3,'PPR-2017-01-Dublin'!$G:$G,\"<=\"&$B3,'PPR-2017-01-Dublin'!#REF!,V$1)","v":{"$error":"#REF!"}},{"$f":"COUNTIFS('PPR-2017-01-Dublin'!$G:$G,\">\"&$A3,'PPR-2017-01-Dublin'!$G:$G,\"<=\"&$B3,'PPR-2017-01-Dublin'!#REF!,W$1)","v":{"$error":"#REF!"}},{"$f":"COUNTIFS('PPR-2017-01-Dublin'!$G:$G,\">\"&$A3,'PPR-2017-01-Dublin'!$G:$G,\"<=\"&$B3,'PPR-2017-01-Dublin'!#REF!,X$1)","v":{"$error":"#REF!"}},{"$f":"COUNTIFS('PPR-2017-01-Dublin'!$G:$G,\">\"&$A3,'PPR-2017-01-Dublin'!$G:$G,\"<=\"&$B3,'PPR-2017-01-Dublin'!#REF!,Y$1)","v":{"$error":"#REF!"}}]
[{"$f":"B3","v":16000},160000,"16,000 to 160k",{"$f":"COUNTIFS('PPR-2017-01-Dublin'!$G:$G,\">\"&$A4,'PPR-2017-01-Dublin'!$G:$G,\"<=\"&$B4,'PPR-2017-01-Dublin'!#REF!,D$1)","v":{"$error":"#REF!"}},{"$f":"COUNTIFS('PPR-2017-01-Dublin'!$G:$G,\">\"&$A4,'PPR-2017-01-Dublin'!$G:$G,\"<=\"&$B4,'PPR-2017-01-Dublin'!#REF!,E$1)","v":{"$error":"#REF!"}},{"$f":"COUNTIFS('PPR-2017-01-Dublin'!$G:$G,\">\"&$A4,'PPR-2017-01-Dublin'!$G:$G,\"<=\"&$B4,'PPR-2017-01-Dublin'!#REF!,F$1)","v":{"$error":"#REF!"}},{"$f":"COUNTIFS('PPR-2017-01-Dublin'!$G:$G,\">\"&$A4,'PPR-2017-01-Dublin'!$G:$G,\"<=\"&$B4,'PPR-2017-01-Dublin'!#REF!,G$1)","v":{"$error":"#REF!"}},{"$f":"COUNTIFS('PPR-2017-01-Dublin'!$G:$G,\">\"&$A4,'PPR-2017-01-Dublin'!$G:$G,\"<=\"&$B4,'PPR-2017-01-Dublin'!#REF!,H$1)","v":{"$error":"#REF!"}},{"$f":"COUNTIFS('PPR-2017-01-Dublin'!$G:$G,\">\"&$A4,'PPR-2017-01-Dublin'!$G:$G,\"<=\"&$B4,'PPR-2017-01-Dublin'!#REF!,I$1)","v":{"$error":"#REF!"}},{"$f":"COUNTIFS('PPR-2017-01-Dublin'!$G:$G,\">\"&$A4,'PPR-2017-01-Dublin'!$G:$G,\"<=\"&$B4,'PPR-2017-01-Dublin'!#REF!,J$1)","v":{"$error":"#REF!"}},{"$f":"COUNTIFS('PPR-2017-01-Dublin'!$G:$G,\">\"&$A4,'PPR-2017-01-Dublin'!$G:$G,\"<=\"&$B4,'PPR-2017-01-Dublin'!#REF!,K$1)","v":{"$error":"#REF!"}},{"$f":"COUNTIFS('PPR-2017-01-Dublin'!$G:$G,\">\"&$A4,'PPR-2017-01-Dublin'!$G:$G,\"<=\"&$B4,'PPR-2017-01-Dublin'!#REF!,L$1)","v":{"$error":"#REF!"}},{"$f":"COUNTIFS('PPR-2017-01-Dublin'!$G:$G,\">\"&$A4,'PPR-2017-01-Dublin'!$G:$G,\"<=\"&$B4,'PPR-2017-01-Dublin'!#REF!,M$1)","v":{"$error":"#REF!"}},{"$f":"COUNTIFS('PPR-2017-01-Dublin'!$G:$G,\">\"&$A4,'PPR-2017-01-Dublin'!$G:$G,\"<=\"&$B4,'PPR-2017-01-Dublin'!#REF!,N$1)","v":{"$error":"#REF!"}},{"$f":"COUNTIFS('PPR-2017-01-Dublin'!$G:$G,\">\"&$A4,'PPR-2017-01-Dublin'!$G:$G,\"<=\"&$B4,'PPR-2017-01-Dublin'!#REF!,O$1)","v":{"$error":"#REF!"}},{"$f":"COUNTIFS('PPR-2017-01-Dublin'!$G:$G,\">\"&$A4,'PPR-2017-01-Dublin'!$G:$G,\"<=\"&$B4,'PPR-2017-01-Dublin'!#REF!,P$1)","v":{"$error":"#REF!"}},{"$f":"COUNTIFS('PPR-2017-01-Dublin'!$G:$G,\">\"&$A4,'PPR-2017-01-Dublin'!$G:$G,\"<=\"&$B4,'PPR-2017-01-Dublin'!#REF!,Q$1)","v":{"$error":"#REF!"}},{"$f":"COUNTIFS('PPR-2017-01-Dublin'!$G:$G,\">\"&$A4,'PPR-2017-01-Dublin'!$G:$G,\"<=\"&$B4,'PPR-2017-01-Dublin'!#REF!,R$1)","v":{"$error":"#REF!"}},{"$f":"COUNTIFS('PPR-2017-01-Dublin'!$G:$G,\">\"&$A4,'PPR-2017-01-Dublin'!$G:$G,\"<=\"&$B4,'PPR-2017-01-Dublin'!#REF!,S$1)","v":{"$error":"#REF!"}},{"$f":"COUNTIFS('PPR-2017-01-Dublin'!$G:$G,\">\"&$A4,'PPR-2017-01-Dublin'!$G:$G,\"<=\"&$B4,'PPR-2017-01-Dublin'!#REF!,T$1)","v":{"$error":"#REF!"}},{"$f":"COUNTIFS('PPR-2017-01-Dublin'!$G:$G,\">\"&$A4,'PPR-2017-01-Dublin'!$G:$G,\"<=\"&$B4,'PPR-2017-01-Dublin'!#REF!,U$1)","v":{"$error":"#REF!"}},{"$f":"COUNTIFS('PPR-2017-01-Dublin'!$G:$G,\">\"&$A4,'PPR-2017-01-Dublin'!$G:$G,\"<=\"&$B4,'PPR-2017-01-Dublin'!#REF!,V$1)","v":{"$error":"#REF!"}},{"$f":"COUNTIFS('PPR-2017-01-Dublin'!$G:$G,\">\"&$A4,'PPR-2017-01-Dublin'!$G:$G,\"<=\"&$B4,'PPR-2017-01-Dublin'!#REF!,W$1)","v":{"$error":"#REF!"}},{"$f":"COUNTIFS('PPR-2017-01-Dublin'!$G:$G,\">\"&$A4,'PPR-2017-01-Dublin'!$G:$G,\"<=\"&$B4,'PPR-2017-01-Dublin'!#REF!,X$1)","v":{"$error":"#REF!"}},{"$f":"COUNTIFS('PPR-2017-01-Dublin'!$G:$G,\">\"&$A4,'PPR-2017-01-Dublin'!$G:$G,\"<=\"&$B4,'PPR-2017-01-Dublin'!#REF!,Y$1)","v":{"$error":"#REF!"}}]
[{"$f":"B4","v":160000},1600000,"160k to 1.6m",{"$f":"COUNTIFS('PPR-2017-01-Dublin'!$G:$G,\">\"&$A5,'PPR-2017-01-Dublin'!$G:$G,\"<=\"&$B5,'PPR-2017-01-Dublin'!#REF!,D$1)","v":{"$error":"#REF!"}},{"$f":"COUNTIFS('PPR-2017-01-Dublin'!$G:$G,\">\"&$A5,'PPR-2017-01-Dublin'!$G:$G,\"<=\"&$B5,'PPR-2017-01-Dublin'!#REF!,E$1)","v":{"$error":"#REF!"}},{"$f":"COUNTIFS('PPR-2017-01-Dublin'!$G:$G,\">\"&$A5,'PPR-2017-01-Dublin'!$G:$G,\"<=\"&$B5,'PPR-2017-01-Dublin'!#REF!,F$1)","v":{"$error":"#REF!"}},{"$f":"COUNTIFS('PPR-2017-01-Dublin'!$G:$G,\">\"&$A5,'PPR-2017-01-Dublin'!$G:$G,\"<=\"&$B5,'PPR-2017-01-Dublin'!#REF!,G$1)","v":{"$error":"#REF!"}},{"$f":"COUNTIFS('PPR-2017-01-Dublin'!$G:$G,\">\"&$A5,'PPR-2017-01-Dublin'!$G:$G,\"<=\"&$B5,'PPR-2017-01-Dublin'!#REF!,H$1)","v":{"$error":"#REF!"}},{"$f":"COUNTIFS('PPR-2017-01-Dublin'!$G:$G,\">\"&$A5,'PPR-2017-01-Dublin'!$G:$G,\"<=\"&$B5,'PPR-2017-01-Dublin'!#REF!,I$1)","v":{"$error":"#REF!"}},{"$f":"COUNTIFS('PPR-2017-01-Dublin'!$G:$G,\">\"&$A5,'PPR-2017-01-Dublin'!$G:$G,\"<=\"&$B5,'PPR-2017-01-Dublin'!#REF!,J$1)","v":{"$error":"#REF!"}},{"$f":"COUNTIFS('PPR-2017-01-Dublin'!$G:$G,\">\"&$A5,'PPR-2017-01-Dublin'!$G:$G,\"<=\"&$B5,'PPR-2017-01-Dublin'!#REF!,K$1)","v":{"$error":"#REF!"}},{"$f":"COUNTIFS('PPR-2017-01-Dublin'!$G:$G,\">\"&$A5,'PPR-2017-01-Dublin'!$G:$G,\"<=\"&$B5,'PPR-2017-01-Dublin'!#REF!,L$1)","v":{"$error":"#REF!"}},{"$f":"COUNTIFS('PPR-2017-01-Dublin'!$G:$G,\">\"&$A5,'PPR-2017-01-Dublin'!$G:$G,\"<=\"&$B5,'PPR-2017-01-Dublin'!#REF!,M$1)","v":{"$error":"#REF!"}},{"$f":"COUNTIFS('PPR-2017-01-Dublin'!$G:$G,\">\"&$A5,'PPR-2017-01-Dublin'!$G:$G,\"<=\"&$B5,'PPR-2017-01-Dublin'!#REF!,N$1)","v":{"$error":"#REF!"}},{"$f":"COUNTIFS('PPR-2017-01-Dublin'!$G:$G,\">\"&$A5,'PPR-2017-01-Dublin'!$G:$G,\"<=\"&$B5,'PPR-2017-01-Dublin'!#REF!,O$1)","v":{"$error":"#REF!"}},{"$f":"COUNTIFS('PPR-2017-01-Dublin'!$G:$G,\">\"&$A5,'PPR-2017-01-Dublin'!$G:$G,\"<=\"&$B5,'PPR-2017-01-Dublin'!#REF!,P$1)","v":{"$error":"#REF!"}},{"$f":"COUNTIFS('PPR-2017-01-Dublin'!$G:$G,\">\"&$A5,'PPR-2017-01-Dublin'!$G:$G,\"<=\"&$B5,'PPR-2017-01-Dublin'!#REF!,Q$1)","v":{"$error":"#REF!"}},{"$f":"COUNTIFS('PPR-2017-01-Dublin'!$G:$G,\">\"&$A5,'PPR-2017-01-Dublin'!$G:$G,\"<=\"&$B5,'PPR-2017-01-Dublin'!#REF!,R$1)","v":{"$error":"#REF!"}},{"$f":"COUNTIFS('PPR-2017-01-Dublin'!$G:$G,\">\"&$A5,'PPR-2017-01-Dublin'!$G:$G,\"<=\"&$B5,'PPR-2017-01-Dublin'!#REF!,S$1)","v":{"$error":"#REF!"}},{"$f":"COUNTIFS('PPR-2017-01-Dublin'!$G:$G,\">\"&$A5,'PPR-2017-01-Dublin'!$G:$G,\"<=\"&$B5,'PPR-2017-01-Dublin'!#REF!,T$1)","v":{"$error":"#REF!"}},{"$f":"COUNTIFS('PPR-2017-01-Dublin'!$G:$G,\">\"&$A5,'PPR-2017-01-Dublin'!$G:$G,\"<=\"&$B5,'PPR-2017-01-Dublin'!#REF!,U$1)","v":{"$error":"#REF!"}},{"$f":"COUNTIFS('PPR-2017-01-Dublin'!$G:$G,\">\"&$A5,'PPR-2017-01-Dublin'!$G:$G,\"<=\"&$B5,'PPR-2017-01-Dublin'!#REF!,V$1)","v":{"$error":"#REF!"}},{"$f":"COUNTIFS('PPR-2017-01-Dublin'!$G:$G,\">\"&$A5,'PPR-2017-01-Dublin'!$G:$G,\"<=\"&$B5,'PPR-2017-01-Dublin'!#REF!,W$1)","v":{"$error":"#REF!"}},{"$f":"COUNTIFS('PPR-2017-01-Dublin'!$G:$G,\">\"&$A5,'PPR-2017-01-Dublin'!$G:$G,\"<=\"&$B5,'PPR-2017-01-Dublin'!#REF!,X$1)","v":{"$error":"#REF!"}},{"$f":"COUNTIFS('PPR-2017-01-Dublin'!$G:$G,\">\"&$A5,'PPR-2017-01-Dublin'!$G:$G,\"<=\"&$B5,'PPR-2017-01-Dublin'!#REF!,Y$1)","v":{"$error":"#REF!"}}]
[{"$f":"B5","v":1600000},16000000,"1.6m to 16m",{"$f":"COUNTIFS('PPR-2017-01-Dublin'!$G:$G,\">\"&$A6,'PPR-2017-01-Dublin'!$G:$G,\"<=\"&$B6,'PPR-2017-01-Dublin'!#REF!,D$1)","v":{"$error":"#REF!"}},{"$f":"COUNTIFS('PPR-2017-01-Dublin'!$G:$G,\">\"&$A6,'PPR-2017-01-Dublin'!$G:$G,\"<=\"&$B6,'PPR-2017-01-Dublin'!#REF!,E$1)","v":{"$error":"#REF!"}},{"$f":"COUNTIFS('PPR-2017-01-Dublin'!$G:$G,\">\"&$A6,'PPR-2017-01-Dublin'!$G:$G,\"<=\"&$B6,'PPR-2017-01-Dublin'!#REF!,F$1)","v":{"$error":"#REF!"}},{"$f":"COUNTIFS('PPR-2017-01-Dublin'!$G:$G,\">\"&$A6,'PPR-2017-01-Dublin'!$G:$G,\"<=\"&$B6,'PPR-2017-01-Dublin'!#REF!,G$1)","v":{"$error":"#REF!"}},{"$f":"COUNTIFS('PPR-2017-01-Dublin'!$G:$G,\">\"&$A6,'PPR-2017-01-Dublin'!$G:$G,\"<=\"&$B6,'PPR-2017-01-Dublin'!#REF!,H$1)","v":{"$error":"#REF!"}},{"$f":"COUNTIFS('PPR-2017-01-Dublin'!$G:$G,\">\"&$A6,'PPR-2017-01-Dublin'!$G:$G,\"<=\"&$B6,'PPR-2017-01-Dublin'!#REF!,I$1)","v":{"$error":"#REF!"}},{"$f":"COUNTIFS('PPR-2017-01-Dublin'!$G:$G,\">\"&$A6,'PPR-2017-01-Dublin'!$G:$G,\"<=\"&$B6,'PPR-2017-01-Dublin'!#REF!,J$1)","v":{"$error":"#REF!"}},{"$f":"COUNTIFS('PPR-2017-01-Dublin'!$G:$G,\">\"&$A6,'PPR-2017-01-Dublin'!$G:$G,\"<=\"&$B6,'PPR-2017-01-Dublin'!#REF!,K$1)","v":{"$error":"#REF!"}},{"$f":"COUNTIFS('PPR-2017-01-Dublin'!$G:$G,\">\"&$A6,'PPR-2017-01-Dublin'!$G:$G,\"<=\"&$B6,'PPR-2017-01-Dublin'!#REF!,L$1)","v":{"$error":"#REF!"}},{"$f":"COUNTIFS('PPR-2017-01-Dublin'!$G:$G,\">\"&$A6,'PPR-2017-01-Dublin'!$G:$G,\"<=\"&$B6,'PPR-2017-01-Dublin'!#REF!,M$1)","v":{"$error":"#REF!"}},{"$f":"COUNTIFS('PPR-2017-01-Dublin'!$G:$G,\">\"&$A6,'PPR-2017-01-Dublin'!$G:$G,\"<=\"&$B6,'PPR-2017-01-Dublin'!#REF!,N$1)","v":{"$error":"#REF!"}},{"$f":"COUNTIFS('PPR-2017-01-Dublin'!$G:$G,\">\"&$A6,'PPR-2017-01-Dublin'!$G:$G,\"<=\"&$B6,'PPR-2017-01-Dublin'!#REF!,O$1)","v":{"$error":"#REF!"}},{"$f":"COUNTIFS('PPR-2017-01-Dublin'!$G:$G,\">\"&$A6,'PPR-2017-01-Dublin'!$G:$G,\"<=\"&$B6,'PPR-2017-01-Dublin'!#REF!,P$1)","v":{"$error":"#REF!"}},{"$f":"COUNTIFS('PPR-2017-01-Dublin'!$G:$G,\">\"&$A6,'PPR-2017-01-Dublin'!$G:$G,\"<=\"&$B6,'PPR-2017-01-Dublin'!#REF!,Q$1)","v":{"$error":"#REF!"}},{"$f":"COUNTIFS('PPR-2017-01-Dublin'!$G:$G,\">\"&$A6,'PPR-2017-01-Dublin'!$G:$G,\"<=\"&$B6,'PPR-2017-01-Dublin'!#REF!,R$1)","v":{"$error":"#REF!"}},{"$f":"COUNTIFS('PPR-2017-01-Dublin'!$G:$G,\">\"&$A6,'PPR-2017-01-Dublin'!$G:$G,\"<=\"&$B6,'PPR-2017-01-Dublin'!#REF!,S$1)","v":{"$error":"#REF!"}},{"$f":"COUNTIFS('PPR-2017-01-Dublin'!$G:$G,\">\"&$A6,'PPR-2017-01-Dublin'!$G:$G,\"<=\"&$B6,'PPR-2017-01-Dublin'!#REF!,T$1)","v":{"$error":"#REF!"}},{"$f":"COUNTIFS('PPR-2017-01-Dublin'!$G:$G,\">\"&$A6,'PPR-2017-01-Dublin'!$G:$G,\"<=\"&$B6,'PPR-2017-01-Dublin'!#REF!,U$1)","v":{"$error":"#REF!"}},{"$f":"COUNTIFS('PPR-2017-01-Dublin'!$G:$G,\">\"&$A6,'PPR-2017-01-Dublin'!$G:$G,\"<=\"&$B6,'PPR-2017-01-Dublin'!#REF!,V$1)","v":{"$error":"#REF!"}},{"$f":"COUNTIFS('PPR-2017-01-Dublin'!$G:$G,\">\"&$A6,'PPR-2017-01-Dublin'!$G:$G,\"<=\"&$B6,'PPR-2017-01-Dublin'!#REF!,W$1)","v":{"$error":"#REF!"}},{"$f":"COUNTIFS('PPR-2017-01-Dublin'!$G:$G,\">\"&$A6,'PPR-2017-01-Dublin'!$G:$G,\"<=\"&$B6,'PPR-2017-01-Dublin'!#REF!,X$1)","v":{"$error":"#REF!"}},{"$f":"COUNTIFS('PPR-2017-01-Dublin'!$G:$G,\">\"&$A6,'PPR-2017-01-Dublin'!$G:$G,\"<=\"&$B6,'PPR-2017-01-Dublin'!#REF!,Y$1)","v":{"$error":"#REF!"}}]
[{"$f":"B6","v":16000000},40000000,"16m - 40m",{"$f":"COUNTIFS('PPR-2017-01-Dublin'!$G:$G,\">\"&$A7,'PPR-2017-01-Dublin'!$G:$G,\"<=\"&$B7,'PPR-2017-01-Dublin'!#REF!,D$1)","v":{"$error":"#REF!"}},{"$f":"COUNTIFS('PPR-2017-01-Dublin'!$G:$G,\">\"&$A7,'PPR-2017-01-Dublin'!$G:$G,\"<=\"&$B7,'PPR-2017-01-Dublin'!#REF!,E$1)","v":{"$error":"#REF!"}},{"$f":"COUNTIFS('PPR-2017-01-Dublin'!$G:$G,\">\"&$A7,'PPR-2017-01-Dublin'!$G:$G,\"<=\"&$B7,'PPR-2017-01-Dublin'!#REF!,F$1)","v":{"$error":"#REF!"}},{"$f":"COUNTIFS('PPR-2017-01-Dublin'!$G:$G,\">\"&$A7,'PPR-2017-01-Dublin'!$G:$G,\"<=\"&$B7,'PPR-2017-01-Dublin'!#REF!,G$1)","v":{"$error":"#REF!"}},{"$f":"COUNTIFS('PPR-2017-01-Dublin'!$G:$G,\">\"&$A7,'PPR-2017-01-Dublin'!$G:$G,\"<=\"&$B7,'PPR-2017-01-Dublin'!#REF!,H$1)","v":{"$error":"#REF!"}},{"$f":"COUNTIFS('PPR-2017-01-Dublin'!$G:$G,\">\"&$A7,'PPR-2017-01-Dublin'!$G:$G,\"<=\"&$B7,'PPR-2017-01-Dublin'!#REF!,I$1)","v":{"$error":"#REF!"}},{"$f":"COUNTIFS('PPR-2017-01-Dublin'!$G:$G,\">\"&$A7,'PPR-2017-01-Dublin'!$G:$G,\"<=\"&$B7,'PPR-2017-01-Dublin'!#REF!,J$1)","v":{"$error":"#REF!"}},{"$f":"COUNTIFS('PPR-2017-01-Dublin'!$G:$G,\">\"&$A7,'PPR-2017-01-Dublin'!$G:$G,\"<=\"&$B7,'PPR-2017-01-Dublin'!#REF!,K$1)","v":{"$error":"#REF!"}},{"$f":"COUNTIFS('PPR-2017-01-Dublin'!$G:$G,\">\"&$A7,'PPR-2017-01-Dublin'!$G:$G,\"<=\"&$B7,'PPR-2017-01-Dublin'!#REF!,L$1)","v":{"$error":"#REF!"}},{"$f":"COUNTIFS('PPR-2017-01-Dublin'!$G:$G,\">\"&$A7,'PPR-2017-01-Dublin'!$G:$G,\"<=\"&$B7,'PPR-2017-01-Dublin'!#REF!,M$1)","v":{"$error":"#REF!"}},{"$f":"COUNTIFS('PPR-2017-01-Dublin'!$G:$G,\">\"&$A7,'PPR-2017-01-Dublin'!$G:$G,\"<=\"&$B7,'PPR-2017-01-Dublin'!#REF!,N$1)","v":{"$error":"#REF!"}},{"$f":"COUNTIFS('PPR-2017-01-Dublin'!$G:$G,\">\"&$A7,'PPR-2017-01-Dublin'!$G:$G,\"<=\"&$B7,'PPR-2017-01-Dublin'!#REF!,O$1)","v":{"$error":"#REF!"}},{"$f":"COUNTIFS('PPR-2017-01-Dublin'!$G:$G,\">\"&$A7,'PPR-2017-01-Dublin'!$G:$G,\"<=\"&$B7,'PPR-2017-01-Dublin'!#REF!,P$1)","v":{"$error":"#REF!"}},{"$f":"COUNTIFS('PPR-2017-01-Dublin'!$G:$G,\">\"&$A7,'PPR-2017-01-Dublin'!$G:$G,\"<=\"&$B7,'PPR-2017-01-Dublin'!#REF!,Q$1)","v":{"$error":"#REF!"}},{"$f":"COUNTIFS('PPR-2017-01-Dublin'!$G:$G,\">\"&$A7,'PPR-2017-01-Dublin'!$G:$G,\"<=\"&$B7,'PPR-2017-01-Dublin'!#REF!,R$1)","v":{"$error":"#REF!"}},{"$f":"COUNTIFS('PPR-2017-01-Dublin'!$G:$G,\">\"&$A7,'PPR-2017-01-Dublin'!$G:$G,\"<=\"&$B7,'PPR-2017-01-Dublin'!#REF!,S$1)","v":{"$error":"#REF!"}},{"$f":"COUNTIFS('PPR-2017-01-Dublin'!$G:$G,\">\"&$A7,'PPR-2017-01-Dublin'!$G:$G,\"<=\"&$B7,'PPR-2017-01-Dublin'!#REF!,T$1)","v":{"$error":"#REF!"}},{"$f":"COUNTIFS('PPR-2017-01-Dublin'!$G:$G,\">\"&$A7,'PPR-2017-01-Dublin'!$G:$G,\"<=\"&$B7,'PPR-2017-01-Dublin'!#REF!,U$1)","v":{"$error":"#REF!"}},{"$f":"COUNTIFS('PPR-2017-01-Dublin'!$G:$G,\">\"&$A7,'PPR-2017-01-Dublin'!$G:$G,\"<=\"&$B7,'PPR-2017-01-Dublin'!#REF!,V$1)","v":{"$error":"#REF!"}},{"$f":"COUNTIFS('PPR-2017-01-Dublin'!$G:$G,\">\"&$A7,'PPR-2017-01-Dublin'!$G:$G,\"<=\"&$B7,'PPR-2017-01-Dublin'!#REF!,W$1)","v":{"$error":"#REF!"}},{"$f":"COUNTIFS('PPR-2017-01-Dublin'!$G:$G,\">\"&$A7,'PPR-2017-01-Dublin'!$G:$G,\"<=\"&$B7,'PPR-2017-01-Dublin'!#REF!,X$1)","v":{"$error":"#REF!"}},{"$f":"COUNTIFS('PPR-2017-01-Dublin'!$G:$G,\">\"&$A7,'PPR-2017-01-Dublin'!$G:$G,\"<=\"&$B7,'PPR-2017-01-Dublin'!#REF!,Y$1)","v":{"$error":"#REF!"}}]

{"sheet":"Regions","index":2,"n_rows":23,"n_cols":2,"rows_kept":23,"cut":false,"hidden":false,"merged":[]}
["Postal Code","Region"]
["Dublin 3","N"]
["Dublin 4","W"]
["Dublin 16","E"]
["Dublin 15","S"]
["Dublin 6","W"]
["Dublin 10","E"]
["Dublin 9","W"]
["Dublin 14","E"]
["Dublin 1","S"]
["Dublin 11","E"]
["Dublin 7","W"]
["Dublin 2","E"]
["Dublin 8","S"]
["Dublin 18","W"]
["Dublin 24","E"]
["Dublin 5","S"]
["Dublin 20","N"]
["Dublin 12","N"]
["Dublin 22","E"]
["Dublin 13","S"]
["Dublin 17","N"]
["Dublin 6w","N"]